VMware Workstation: Erro, os módulos devem ser compilados ... - como consertar?


13

quando tento iniciar o VMWARE-WORKSTATION, recebo o seguinte erro:

Antes de executar o VMware, vários módulos devem ser compilados e carregados no kernel CANCEL / INSTALL

Sem erros, quando eu seleciono INSTALAR, nada acontece é fechado.

Eu instalo manualmente:

sudo apt-get install open-vm-tools open-vm-tools-dev open-vm-dkms open-vm-toolbox open-vm-tools-dev

Mas já instalado para as versões mais recentes.

Vou começar uma recompensa para corrigir isso.

Ubuntu 13.04 64bit

pst007x@pst007x-Serval-Professional:~$ uname -a
Linux pst007x-Serval-Professional 3.9.0-030900-generic #201304291257 SMP Mon Apr 29 16:58:15 UTC 2013 x86_64 x86_64 x86_64 GNU/Linux

Eu desinstalei e reinstalei todos os componentes, mas o mesmo problema.

Eu tentei um kernel diferente, mas acabei com o mesmo problema.

Tentei isso como sugerido: aqui

#!/bin/bash
cd
cp -prn /usr/lib/vmware/modules/source /usr/lib/vmware/modules/source-backup
mkdir fixed
cd fixed
find /usr/lib/vmware/modules/source -name "*.tar" -exec tar xf '{}' \;

## add missing header on kernels
sed -i '/#include "compat_wait.h"/a\#include "compat_sched.h"' vmnet-only/vnetUserListener.c
sed -i '/#include "compat_page.h"/a\#include "compat_sched.h"' vmci-only/include/pgtbl.h
## comment out an invalid definition
sed -i 's|\(extern void poll_initwait(compat_poll_wqueues \*);\)|//\1|' *-only/include/compat_wait.h

tar cf vmblock.tar vmblock-only
tar cf vmci.tar vmci-only
tar cf vmmon.tar vmmon-only
tar cf vmnet.tar vmnet-only
tar cf vmppuser.tar vmppuser-only
tar cf vsock.tar vsock-only

cp -p *.tar /usr/lib/vmware/modules/source

cd /lib/modules/`uname -r`/build/include/linux
ln -s ../generated/autoconf.h
ln -s ../generated/utsrelease.h
cd

vmware-modconfig --console --install-all

# clean up
cd
rm -rf fixed
cd /lib/modules/`uname -r`/build/include/linux
rm autoconf.h utsrelease.h
cd /usr/lib/vmware/modules/
rm -rf source-backup
cd

Não funcionou, resultados do script no terminal:

pst007x@pst007x-Serval-Professional:~/Desktop$ sudo ./run
[sudo] password for pst007x: 
sed: can't read vmci-only/include/pgtbl.h: No such file or directory
sed: can't read *-only/include/compat_wait.h: No such file or directory
tar: vmppuser-only: Cannot stat: No such file or directory
tar: Exiting with failure status due to previous errors
ln: failed to create symbolic link ‘./autoconf.h’: File exists
ln: failed to create symbolic link ‘./utsrelease.h’: File exists
Stopping VMware services:
   VMware Authentication Daemon                                        done
   VM communication interface socket family                            done
   Virtual machine communication interface                             done
   Virtual machine monitor                                             done
   Blocking file system                                                done
Using 2.6.x kernel build system.
make: Entering directory `/tmp/modconfig-tGleah/vmmon-only'
/usr/bin/make -C /lib/modules/3.9.0-030900-generic/build/include/.. SUBDIRS=$PWD SRCROOT=$PWD/. \
      MODULEBUILDDIR= modules
make[1]: Entering directory `/usr/src/linux-headers-3.9.0-030900-generic'
  CC [M]  /tmp/modconfig-tGleah/vmmon-only/linux/driver.o
  CC [M]  /tmp/modconfig-tGleah/vmmon-only/linux/driverLog.o
  CC [M]  /tmp/modconfig-tGleah/vmmon-only/linux/hostif.o
  CC [M]  /tmp/modconfig-tGleah/vmmon-only/common/apic.o
  CC [M]  /tmp/modconfig-tGleah/vmmon-only/common/comport.o
  CC [M]  /tmp/modconfig-tGleah/vmmon-only/common/cpuid.o
  CC [M]  /tmp/modconfig-tGleah/vmmon-only/common/hashFunc.o
  CC [M]  /tmp/modconfig-tGleah/vmmon-only/common/memtrack.o
  CC [M]  /tmp/modconfig-tGleah/vmmon-only/common/phystrack.o
  CC [M]  /tmp/modconfig-tGleah/vmmon-only/common/task.o
  CC [M]  /tmp/modconfig-tGleah/vmmon-only/common/vmx86.o
  CC [M]  /tmp/modconfig-tGleah/vmmon-only/vmcore/moduleloop.o
  LD [M]  /tmp/modconfig-tGleah/vmmon-only/vmmon.o
  Building modules, stage 2.
  MODPOST 1 modules
  CC      /tmp/modconfig-tGleah/vmmon-only/vmmon.mod.o
  LD [M]  /tmp/modconfig-tGleah/vmmon-only/vmmon.ko
make[1]: Leaving directory `/usr/src/linux-headers-3.9.0-030900-generic'
/usr/bin/make -C $PWD SRCROOT=$PWD/. \
      MODULEBUILDDIR= postbuild
make[1]: Entering directory `/tmp/modconfig-tGleah/vmmon-only'
make[1]: `postbuild' is up to date.
make[1]: Leaving directory `/tmp/modconfig-tGleah/vmmon-only'
cp -f vmmon.ko ./../vmmon.o
make: Leaving directory `/tmp/modconfig-tGleah/vmmon-only'
Using 2.6.x kernel build system.
make: Entering directory `/tmp/modconfig-tGleah/vmnet-only'
/usr/bin/make -C /lib/modules/3.9.0-030900-generic/build/include/.. SUBDIRS=$PWD SRCROOT=$PWD/. \
      MODULEBUILDDIR= modules
make[1]: Entering directory `/usr/src/linux-headers-3.9.0-030900-generic'
  CC [M]  /tmp/modconfig-tGleah/vmnet-only/driver.o
  CC [M]  /tmp/modconfig-tGleah/vmnet-only/hub.o
  CC [M]  /tmp/modconfig-tGleah/vmnet-only/userif.o
  CC [M]  /tmp/modconfig-tGleah/vmnet-only/netif.o
  CC [M]  /tmp/modconfig-tGleah/vmnet-only/bridge.o
  CC [M]  /tmp/modconfig-tGleah/vmnet-only/filter.o
  CC [M]  /tmp/modconfig-tGleah/vmnet-only/procfs.o
  CC [M]  /tmp/modconfig-tGleah/vmnet-only/smac_compat.o
  CC [M]  /tmp/modconfig-tGleah/vmnet-only/smac.o
  CC [M]  /tmp/modconfig-tGleah/vmnet-only/vnetEvent.o
  CC [M]  /tmp/modconfig-tGleah/vmnet-only/vnetUserListener.o
  LD [M]  /tmp/modconfig-tGleah/vmnet-only/vmnet.o
  Building modules, stage 2.
  MODPOST 1 modules
  CC      /tmp/modconfig-tGleah/vmnet-only/vmnet.mod.o
  LD [M]  /tmp/modconfig-tGleah/vmnet-only/vmnet.ko
make[1]: Leaving directory `/usr/src/linux-headers-3.9.0-030900-generic'
/usr/bin/make -C $PWD SRCROOT=$PWD/. \
      MODULEBUILDDIR= postbuild
make[1]: Entering directory `/tmp/modconfig-tGleah/vmnet-only'
make[1]: `postbuild' is up to date.
make[1]: Leaving directory `/tmp/modconfig-tGleah/vmnet-only'
cp -f vmnet.ko ./../vmnet.o
make: Leaving directory `/tmp/modconfig-tGleah/vmnet-only'
Using 2.6.x kernel build system.
make: Entering directory `/tmp/modconfig-tGleah/vmblock-only'
/usr/bin/make -C /lib/modules/3.9.0-030900-generic/build/include/.. SUBDIRS=$PWD SRCROOT=$PWD/. \
      MODULEBUILDDIR= modules
make[1]: Entering directory `/usr/src/linux-headers-3.9.0-030900-generic'
  CC [M]  /tmp/modconfig-tGleah/vmblock-only/linux/block.o
  CC [M]  /tmp/modconfig-tGleah/vmblock-only/linux/control.o
  CC [M]  /tmp/modconfig-tGleah/vmblock-only/linux/dentry.o
  CC [M]  /tmp/modconfig-tGleah/vmblock-only/linux/file.o
  CC [M]  /tmp/modconfig-tGleah/vmblock-only/linux/filesystem.o
  CC [M]  /tmp/modconfig-tGleah/vmblock-only/linux/inode.o
  CC [M]  /tmp/modconfig-tGleah/vmblock-only/linux/module.o
  CC [M]  /tmp/modconfig-tGleah/vmblock-only/linux/stubs.o
/tmp/modconfig-tGleah/vmblock-only/linux/dentry.c:38:4: warning: initialisation from incompatible pointer type [enabled by default]
/tmp/modconfig-tGleah/vmblock-only/linux/dentry.c:38:4: warning: (near initialisation for ‘LinkDentryOps.d_revalidate’) [enabled by default]
/tmp/modconfig-tGleah/vmblock-only/linux/dentry.c: In function ‘DentryOpRevalidate’:
/tmp/modconfig-tGleah/vmblock-only/linux/dentry.c:104:7: warning: passing argument 2 of ‘actualDentry->d_op->d_revalidate’ makes integer from pointer without a cast [enabled by default]
/tmp/modconfig-tGleah/vmblock-only/linux/dentry.c:104:7: note: expected ‘unsigned int’ but argument is of type ‘struct nameidata *’
  CC [M]  /tmp/modconfig-tGleah/vmblock-only/linux/super.o
/tmp/modconfig-tGleah/vmblock-only/linux/control.c: In function ‘ExecuteBlockOp’:
/tmp/modconfig-tGleah/vmblock-only/linux/control.c:285:9: warning: assignment from incompatible pointer type [enabled by default]
/tmp/modconfig-tGleah/vmblock-only/linux/control.c:296:4: warning: passing argument 1 of ‘putname’ from incompatible pointer type [enabled by default]
In file included from include/linux/proc_fs.h:5:0,
                 from /tmp/modconfig-tGleah/vmblock-only/linux/control.c:28:
include/linux/fs.h:2040:13: note: expected ‘struct filename *’ but argument is of type ‘char *’
/tmp/modconfig-tGleah/vmblock-only/linux/inode.c:49:4: warning: initialisation from incompatible pointer type [enabled by default]
/tmp/modconfig-tGleah/vmblock-only/linux/inode.c:49:4: warning: (near initialisation for ‘RootInodeOps.lookup’) [enabled by default]
  LD [M]  /tmp/modconfig-tGleah/vmblock-only/vmblock.o
  Building modules, stage 2.
  MODPOST 1 modules
WARNING: "putname" [/tmp/modconfig-tGleah/vmblock-only/vmblock.ko] undefined!
  CC      /tmp/modconfig-tGleah/vmblock-only/vmblock.mod.o
  LD [M]  /tmp/modconfig-tGleah/vmblock-only/vmblock.ko
make[1]: Leaving directory `/usr/src/linux-headers-3.9.0-030900-generic'
/usr/bin/make -C $PWD SRCROOT=$PWD/. \
      MODULEBUILDDIR= postbuild
make[1]: Entering directory `/tmp/modconfig-tGleah/vmblock-only'
make[1]: `postbuild' is up to date.
make[1]: Leaving directory `/tmp/modconfig-tGleah/vmblock-only'
cp -f vmblock.ko ./../vmblock.o
make: Leaving directory `/tmp/modconfig-tGleah/vmblock-only'
Using 2.6.x kernel build system.
make: Entering directory `/tmp/modconfig-tGleah/vmci-only'
/usr/bin/make -C /lib/modules/3.9.0-030900-generic/build/include/.. SUBDIRS=$PWD SRCROOT=$PWD/. \
      MODULEBUILDDIR= modules
make[1]: Entering directory `/usr/src/linux-headers-3.9.0-030900-generic'
  CC [M]  /tmp/modconfig-tGleah/vmci-only/linux/driver.o
  CC [M]  /tmp/modconfig-tGleah/vmci-only/linux/vmciKernelIf.o
  CC [M]  /tmp/modconfig-tGleah/vmci-only/common/vmciContext.o
  CC [M]  /tmp/modconfig-tGleah/vmci-only/common/vmciDoorbell.o
  CC [M]  /tmp/modconfig-tGleah/vmci-only/common/vmciDriver.o
  CC [M]  /tmp/modconfig-tGleah/vmci-only/common/vmciDatagram.o
  CC [M]  /tmp/modconfig-tGleah/vmci-only/common/vmciEvent.o
  CC [M]  /tmp/modconfig-tGleah/vmci-only/common/vmciHashtable.o
/tmp/modconfig-tGleah/vmci-only/linux/driver.c:127:4: error: implicit declaration of function ‘__devexit_p’ [-Werror=implicit-function-declaration]
/tmp/modconfig-tGleah/vmci-only/linux/driver.c:127:4: error: initialiser element is not constant
/tmp/modconfig-tGleah/vmci-only/linux/driver.c:127:4: error: (near initialisation for ‘vmci_driver.remove’)
/tmp/modconfig-tGleah/vmci-only/linux/driver.c:1754:1: error: expected ‘=’, ‘,’, ‘;’, ‘asm’ or ‘__attribute__’ before ‘vmci_probe_device’
/tmp/modconfig-tGleah/vmci-only/linux/driver.c:1982:1: error: expected ‘=’, ‘,’, ‘;’, ‘asm’ or ‘__attribute__’ before ‘vmci_remove_device’
/tmp/modconfig-tGleah/vmci-only/linux/driver.c:119:12: warning: ‘vmci_probe_device’ used but never defined [enabled by default]
/tmp/modconfig-tGleah/vmci-only/linux/driver.c:121:13: warning: ‘vmci_remove_device’ used but never defined [enabled by default]
/tmp/modconfig-tGleah/vmci-only/linux/driver.c:2063:1: warning: ‘vmci_interrupt’ defined but not used [-Wunused-function]
/tmp/modconfig-tGleah/vmci-only/linux/driver.c:2137:1: warning: ‘vmci_interrupt_bm’ defined but not used [-Wunused-function]
/tmp/modconfig-tGleah/vmci-only/linux/driver.c:1717:1: warning: ‘vmci_enable_msix’ defined but not used [-Wunused-function]
cc1: some warnings being treated as errors
make[2]: *** [/tmp/modconfig-tGleah/vmci-only/linux/driver.o] Error 1
make[2]: *** Waiting for unfinished jobs....
make[1]: *** [_module_/tmp/modconfig-tGleah/vmci-only] Error 2
make[1]: Leaving directory `/usr/src/linux-headers-3.9.0-030900-generic'
make: *** [vmci.ko] Error 2
make: Leaving directory `/tmp/modconfig-tGleah/vmci-only'
Unable to install all modules.  See log for details.

pst007x@pst007x-Serval-Professional:~/Desktop$ 

Tentei como sugerido abaixo, mas o mesmo problema:

pst007x@pst007x-Serval-Professional:~$ sudo vmware-modconfig --console --install-all
[sudo] password for pst007x: 
Stopping VMware services:
   VMware Authentication Daemon                                        done
   VM communication interface socket family                            done
   Virtual machine communication interface                             done
   Virtual machine monitor                                             done
   Blocking file system                                                done
Using 2.6.x kernel build system.
make: Entering directory `/tmp/modconfig-IFjtiM/vmmon-only'
/usr/bin/make -C /lib/modules/3.9.0-030900-generic/build/include/.. SUBDIRS=$PWD SRCROOT=$PWD/. \
      MODULEBUILDDIR= modules
make[1]: Entering directory `/usr/src/linux-headers-3.9.0-030900-generic'
  CC [M]  /tmp/modconfig-IFjtiM/vmmon-only/linux/driver.o
  CC [M]  /tmp/modconfig-IFjtiM/vmmon-only/linux/driverLog.o
  CC [M]  /tmp/modconfig-IFjtiM/vmmon-only/linux/hostif.o
  CC [M]  /tmp/modconfig-IFjtiM/vmmon-only/common/apic.o
  CC [M]  /tmp/modconfig-IFjtiM/vmmon-only/common/comport.o
  CC [M]  /tmp/modconfig-IFjtiM/vmmon-only/common/cpuid.o
  CC [M]  /tmp/modconfig-IFjtiM/vmmon-only/common/hashFunc.o
  CC [M]  /tmp/modconfig-IFjtiM/vmmon-only/common/memtrack.o
  CC [M]  /tmp/modconfig-IFjtiM/vmmon-only/common/phystrack.o
  CC [M]  /tmp/modconfig-IFjtiM/vmmon-only/common/task.o
  CC [M]  /tmp/modconfig-IFjtiM/vmmon-only/common/vmx86.o
  CC [M]  /tmp/modconfig-IFjtiM/vmmon-only/vmcore/moduleloop.o
  LD [M]  /tmp/modconfig-IFjtiM/vmmon-only/vmmon.o
  Building modules, stage 2.
  MODPOST 1 modules
  CC      /tmp/modconfig-IFjtiM/vmmon-only/vmmon.mod.o
  LD [M]  /tmp/modconfig-IFjtiM/vmmon-only/vmmon.ko
make[1]: Leaving directory `/usr/src/linux-headers-3.9.0-030900-generic'
/usr/bin/make -C $PWD SRCROOT=$PWD/. \
      MODULEBUILDDIR= postbuild
make[1]: Entering directory `/tmp/modconfig-IFjtiM/vmmon-only'
make[1]: `postbuild' is up to date.
make[1]: Leaving directory `/tmp/modconfig-IFjtiM/vmmon-only'
cp -f vmmon.ko ./../vmmon.o
make: Leaving directory `/tmp/modconfig-IFjtiM/vmmon-only'
Using 2.6.x kernel build system.
make: Entering directory `/tmp/modconfig-IFjtiM/vmnet-only'
/usr/bin/make -C /lib/modules/3.9.0-030900-generic/build/include/.. SUBDIRS=$PWD SRCROOT=$PWD/. \
      MODULEBUILDDIR= modules
make[1]: Entering directory `/usr/src/linux-headers-3.9.0-030900-generic'
  CC [M]  /tmp/modconfig-IFjtiM/vmnet-only/driver.o
  CC [M]  /tmp/modconfig-IFjtiM/vmnet-only/hub.o
  CC [M]  /tmp/modconfig-IFjtiM/vmnet-only/userif.o
  CC [M]  /tmp/modconfig-IFjtiM/vmnet-only/netif.o
  CC [M]  /tmp/modconfig-IFjtiM/vmnet-only/bridge.o
  CC [M]  /tmp/modconfig-IFjtiM/vmnet-only/filter.o
  CC [M]  /tmp/modconfig-IFjtiM/vmnet-only/procfs.o
  CC [M]  /tmp/modconfig-IFjtiM/vmnet-only/smac_compat.o
  CC [M]  /tmp/modconfig-IFjtiM/vmnet-only/smac.o
  CC [M]  /tmp/modconfig-IFjtiM/vmnet-only/vnetEvent.o
  CC [M]  /tmp/modconfig-IFjtiM/vmnet-only/vnetUserListener.o
  LD [M]  /tmp/modconfig-IFjtiM/vmnet-only/vmnet.o
  Building modules, stage 2.
  MODPOST 1 modules
  CC      /tmp/modconfig-IFjtiM/vmnet-only/vmnet.mod.o
  LD [M]  /tmp/modconfig-IFjtiM/vmnet-only/vmnet.ko
make[1]: Leaving directory `/usr/src/linux-headers-3.9.0-030900-generic'
/usr/bin/make -C $PWD SRCROOT=$PWD/. \
      MODULEBUILDDIR= postbuild
make[1]: Entering directory `/tmp/modconfig-IFjtiM/vmnet-only'
make[1]: `postbuild' is up to date.
make[1]: Leaving directory `/tmp/modconfig-IFjtiM/vmnet-only'
cp -f vmnet.ko ./../vmnet.o
make: Leaving directory `/tmp/modconfig-IFjtiM/vmnet-only'
Using 2.6.x kernel build system.
make: Entering directory `/tmp/modconfig-IFjtiM/vmblock-only'
/usr/bin/make -C /lib/modules/3.9.0-030900-generic/build/include/.. SUBDIRS=$PWD SRCROOT=$PWD/. \
      MODULEBUILDDIR= modules
make[1]: Entering directory `/usr/src/linux-headers-3.9.0-030900-generic'
  CC [M]  /tmp/modconfig-IFjtiM/vmblock-only/linux/block.o
  CC [M]  /tmp/modconfig-IFjtiM/vmblock-only/linux/control.o
  CC [M]  /tmp/modconfig-IFjtiM/vmblock-only/linux/dentry.o
  CC [M]  /tmp/modconfig-IFjtiM/vmblock-only/linux/file.o
  CC [M]  /tmp/modconfig-IFjtiM/vmblock-only/linux/filesystem.o
  CC [M]  /tmp/modconfig-IFjtiM/vmblock-only/linux/inode.o
  CC [M]  /tmp/modconfig-IFjtiM/vmblock-only/linux/module.o
  CC [M]  /tmp/modconfig-IFjtiM/vmblock-only/linux/stubs.o
/tmp/modconfig-IFjtiM/vmblock-only/linux/control.c: In function ‘ExecuteBlockOp’:
/tmp/modconfig-IFjtiM/vmblock-only/linux/control.c:285:9: warning: assignment from incompatible pointer type [enabled by default]
/tmp/modconfig-IFjtiM/vmblock-only/linux/control.c:296:4: warning: passing argument 1 of ‘putname’ from incompatible pointer type [enabled by default]
In file included from include/linux/proc_fs.h:5:0,
                 from /tmp/modconfig-IFjtiM/vmblock-only/linux/control.c:28:
include/linux/fs.h:2040:13: note: expected ‘struct filename *’ but argument is of type ‘char *’
/tmp/modconfig-IFjtiM/vmblock-only/linux/dentry.c:38:4: warning: initialisation from incompatible pointer type [enabled by default]
/tmp/modconfig-IFjtiM/vmblock-only/linux/dentry.c:38:4: warning: (near initialisation for ‘LinkDentryOps.d_revalidate’) [enabled by default]
/tmp/modconfig-IFjtiM/vmblock-only/linux/dentry.c: In function ‘DentryOpRevalidate’:
/tmp/modconfig-IFjtiM/vmblock-only/linux/dentry.c:104:7: warning: passing argument 2 of ‘actualDentry->d_op->d_revalidate’ makes integer from pointer without a cast [enabled by default]
/tmp/modconfig-IFjtiM/vmblock-only/linux/dentry.c:104:7: note: expected ‘unsigned int’ but argument is of type ‘struct nameidata *’
/tmp/modconfig-IFjtiM/vmblock-only/linux/inode.c:49:4: warning: initialisation from incompatible pointer type [enabled by default]
/tmp/modconfig-IFjtiM/vmblock-only/linux/inode.c:49:4: warning: (near initialisation for ‘RootInodeOps.lookup’) [enabled by default]
  CC [M]  /tmp/modconfig-IFjtiM/vmblock-only/linux/super.o
  LD [M]  /tmp/modconfig-IFjtiM/vmblock-only/vmblock.o
  Building modules, stage 2.
  MODPOST 1 modules
WARNING: "putname" [/tmp/modconfig-IFjtiM/vmblock-only/vmblock.ko] undefined!
  CC      /tmp/modconfig-IFjtiM/vmblock-only/vmblock.mod.o
  LD [M]  /tmp/modconfig-IFjtiM/vmblock-only/vmblock.ko
make[1]: Leaving directory `/usr/src/linux-headers-3.9.0-030900-generic'
/usr/bin/make -C $PWD SRCROOT=$PWD/. \
      MODULEBUILDDIR= postbuild
make[1]: Entering directory `/tmp/modconfig-IFjtiM/vmblock-only'
make[1]: `postbuild' is up to date.
make[1]: Leaving directory `/tmp/modconfig-IFjtiM/vmblock-only'
cp -f vmblock.ko ./../vmblock.o
make: Leaving directory `/tmp/modconfig-IFjtiM/vmblock-only'
Using 2.6.x kernel build system.
make: Entering directory `/tmp/modconfig-IFjtiM/vmci-only'
/usr/bin/make -C /lib/modules/3.9.0-030900-generic/build/include/.. SUBDIRS=$PWD SRCROOT=$PWD/. \
      MODULEBUILDDIR= modules
make[1]: Entering directory `/usr/src/linux-headers-3.9.0-030900-generic'
  CC [M]  /tmp/modconfig-IFjtiM/vmci-only/linux/driver.o
  CC [M]  /tmp/modconfig-IFjtiM/vmci-only/linux/vmciKernelIf.o
  CC [M]  /tmp/modconfig-IFjtiM/vmci-only/common/vmciContext.o
  CC [M]  /tmp/modconfig-IFjtiM/vmci-only/common/vmciDatagram.o
  CC [M]  /tmp/modconfig-IFjtiM/vmci-only/common/vmciDoorbell.o
  CC [M]  /tmp/modconfig-IFjtiM/vmci-only/common/vmciDriver.o
  CC [M]  /tmp/modconfig-IFjtiM/vmci-only/common/vmciHashtable.o
  CC [M]  /tmp/modconfig-IFjtiM/vmci-only/common/vmciEvent.o
/tmp/modconfig-IFjtiM/vmci-only/linux/driver.c:127:4: error: implicit declaration of function ‘__devexit_p’ [-Werror=implicit-function-declaration]
/tmp/modconfig-IFjtiM/vmci-only/linux/driver.c:127:4: error: initialiser element is not constant
/tmp/modconfig-IFjtiM/vmci-only/linux/driver.c:127:4: error: (near initialisation for ‘vmci_driver.remove’)
/tmp/modconfig-IFjtiM/vmci-only/linux/driver.c:1754:1: error: expected ‘=’, ‘,’, ‘;’, ‘asm’ or ‘__attribute__’ before ‘vmci_probe_device’
/tmp/modconfig-IFjtiM/vmci-only/linux/driver.c:1982:1: error: expected ‘=’, ‘,’, ‘;’, ‘asm’ or ‘__attribute__’ before ‘vmci_remove_device’
/tmp/modconfig-IFjtiM/vmci-only/linux/driver.c:119:12: warning: ‘vmci_probe_device’ used but never defined [enabled by default]
/tmp/modconfig-IFjtiM/vmci-only/linux/driver.c:121:13: warning: ‘vmci_remove_device’ used but never defined [enabled by default]
/tmp/modconfig-IFjtiM/vmci-only/linux/driver.c:2063:1: warning: ‘vmci_interrupt’ defined but not used [-Wunused-function]
/tmp/modconfig-IFjtiM/vmci-only/linux/driver.c:2137:1: warning: ‘vmci_interrupt_bm’ defined but not used [-Wunused-function]
/tmp/modconfig-IFjtiM/vmci-only/linux/driver.c:1717:1: warning: ‘vmci_enable_msix’ defined but not used [-Wunused-function]
cc1: some warnings being treated as errors
make[2]: *** [/tmp/modconfig-IFjtiM/vmci-only/linux/driver.o] Error 1
make[2]: *** Waiting for unfinished jobs....
make[1]: *** [_module_/tmp/modconfig-IFjtiM/vmci-only] Error 2
make[1]: Leaving directory `/usr/src/linux-headers-3.9.0-030900-generic'
make: *** [vmci.ko] Error 2
make: Leaving directory `/tmp/modconfig-IFjtiM/vmci-only'
Unable to install all modules.  See log for details.

pst007x@pst007x-Serval-Professional:~$ sudo apt-get install build-essential
Reading package lists... Done
Building dependency tree       
Reading state information... Done
build-essential is already the newest version.
0 upgraded, 0 newly installed, 0 to remove and 1 not upgraded.
pst007x@pst007x-Serval-Professional:~$ 

Moderador: tentei todas as sugestões em outras postagens, mas elas não abordam esse problema em particular.

Isso não é duplicado, os outros lançamentos não abordam esse problema específico e não oferecem soluções


3
tente este> sudo vmware-modconfig --console --install-all
— Qasim

sudo apt-get install build-essential
— Qasim

Após o google-fu: erro "vmware" "driver.c" "__devexit_p". Como indicado aqui , você precisa aplicar um patch, o problema é: esse patch não é para o seu kernel específico. Mas ... tente mesmo assim ... Você deve tentar o google-fu assim, mas adicione sua versão do kernel. Não encontrei nada na sua versão do kernel, portanto, você pode precisar de um patch para esse kernel nos fóruns do vmware.
— Aquarius Power

Eu tenho o patch, eu o instalei durante a execução de um kernel anterior, funcionou bem, então .. mas não é instalado no meu sistema atual ... Talvez o vmware não possa ser executado no kernel que estou usando ...
— pst007x

Respostas:


12

Eu tenho o mesmo problema Depois de algum joojling (googling), resolvi o problema ny seguindo as etapas:

  1. (Não tenho certeza se isso afeta o meu problema), como @ pst007x é executado

    cd /lib/modules/$(uname -r)/build/include/linux 
    sudo ln -s ../generated/utsrelease.h 
    sudo ln -s ../generated/autoconf.h 
    sudo ln -s ../generated/uapi/linux/version.h
    
  2. Corri o seguinte código como @Qasim sugeriu

    sudo vmware-modconfig --console --install-all
    

Eu tenho o Ubuntu 13.04-64bit, desenvolvido com o kernel 3.8.0-21-generic e o VMware Player 5.0.2 build-1031769

Boa sorte!


eu acho que do kernel corrigido o problema vmware 3.8.0-21-generic ....
— Qasim

Isso não aconteceu. Tinha que adicionar o link version.h e executar o comando vmware-modconfig a partir de cima, e a instalação funcionou.
— Ubfan1

1

Acredito que o problema é que você tem os cabeçalhos errados do kernel, parece que uma dessas sugestões está tentando usar cabeçalhos do kernel para 3.9.0, 13.04 não usa a versão 3.88 do kernel? Tente obter os cabeçalhos do kernel do apt, faça:

sudo apt-get install linux-headers-$(uname -r)(emprestado do nixCraft )

e tente instalá-lo novamente


Eu tive o problema com o Kernel enviado com o 13.04 (funcionou bem no kernel mais antigo com o 12.10). Eu tive que atualizar meu Kernel para 3.9.0 porque, após a atualização para 13.04, meu sistema travava intermitentemente na inicialização. A atualização do kernel resolveu esse problema. Obrigado
— pst007x

1

Eu tive exatamente o mesmo problema quando atualizei de 12.10 para 13.04. Quando iniciei o VMware, recebia a mesma mensagem:

Before you can run VMware, several modules must be compiled and loaded into the kernel CANCEL / INSTALL

Quando eu clicava em INSTALAR, nada acontecia. Eu verifiquei / var / log / e apport estava relatando o seguinte erro:

ERROR: apport (pid 3061) Thu Apr 25 08:48:51 2013: executable: /usr/lib/vmware/bin/appLoader (command line "/usr/lib/vmware/bin/vmware-gksu --sudo-mode --message=Please\ enter\ your\ password\ to\ proceed. '/usr/bin/vmware-modconfig'\ --icon='vmware-workstation'\ --appname='VMware'")

Parece haver um problema com / usr / lib / vmware / bin / vmware-gksu que causa o travamento. Posso reproduzir o problema de forma confiável sempre que executo o comando. Consegui resolver o problema executando o comando manualmente. Aqui estão os comandos que corri:

sudo apt-get install linux-headers-3.8.0-19-generic
sudo /usr/bin/vmware-modconfig --icon=vmware-workstation --appname=VMware

Você vê algo semelhante em / var / log / apport?


Depois de fazer algumas pesquisas adicionais, acredito que o problema esteja relacionado à 13.04 removendo o suporte ao gksu. Veja askubuntu.com/questions/284306/…
— notkevin

Eu ainda sou capaz de executar o comando gksu para lançar Nautilus, por exemplo ...
— pst007x

Tentei: sudo / usr / bin / vmware-modconfig --icon = VMware-workstation --appname = VMware ....... mas o VMware é iniciado e exibe uma mensagem
— COMPILING

0

Eu tive o mesmo problema, combinando algumas soluções acima funcionou para mim, eu sou um desenvolvedor, por isso já tinha os cabeçalhos Linux mais recentes, mas caso você não tenha

sudo apt-get install linux-headers-$(uname -r)
sudo vmware-modconfig --console --install-all

Alguns erros foram gerados, apesar deles agora estarem funcionando perfeitamente.

Deve-se observar que esse método foi testado com o VMWare Player, não com a estação de trabalho (a chave da minha estação de trabalho está desatualizada, a versão mais recente que tenho é a versão 7)

Ao utilizar nosso site, você reconhece que leu e compreendeu nossa Política de Cookies e nossa Política de Privacidade.
Licensed under cc by-sa 3.0 with attribution required.